Target
Advanced glycosylation end product-specific receptor
Ligand
BDBM453288
Substrate
Meas. Tech.
High-Throughput Screening Assay
Kd
500±n/a nM
Citation
 Schmidt, AMRamasamy, RShekhtman, ARai, VManigrasso, MB Amino, amido and heterocyclic compounds as modulators of RAGE activity and uses thereof US Patent  US10729695 Publication Date 8/4/2020 
Target
Name:
Advanced glycosylation end product-specific receptor
Synonyms:
AGER RAGE_HUMAN | Receptor for advanced glycosylation end products
Type:
PROTEIN
Mol. Mass.:
42800.11
Organism:
Homo sapiens (Human)
Description:
ChEMBL_1339877
Residue:
404
  
Inhibitor
Name:
BDBM453288
Synonyms:
US10729695, Compound CB-9
Type:
Small organic molecule
Emp. Form.:
C9H11F2NO2S
Mol. Mass.:
235.251
SMILES:
CN(C(F)F)S(=O)(=O)c1ccc(C)cc1
: