Target
Advanced glycosylation end product-specific receptor
Ligand
BDBM32273
Substrate
Meas. Tech.
High-Throughput Screening Assay
Kd
1.20±0.5 nM
Citation
 Schmidt, AMRamasamy, RShekhtman, ARai, VManigrasso, MB Amino, amido and heterocyclic compounds as modulators of RAGE activity and uses thereof US Patent  US10729695 Publication Date 8/4/2020 
Target
Name:
Advanced glycosylation end product-specific receptor
Synonyms:
AGER RAGE_HUMAN | Receptor for advanced glycosylation end products
Type:
PROTEIN
Mol. Mass.:
42800.11
Organism:
Homo sapiens (Human)
Description:
ChEMBL_1339877
Residue:
404
  
Inhibitor
Name:
BDBM32273
Synonyms:
2,8-dimethyl-5,6-dihydrodipyrrolo[1,2-b:1',2'-e]pyrazine SMR000054319 cid_778626
Type:
Small organic molecule
Emp. Form.:
C12H14N2
Mol. Mass.:
186.253
SMILES:
Cc1cc2-c3ccc(C)n3CCn2c1
: