Target
Advanced glycosylation end product-specific receptor
Ligand
BDBM453300
Substrate
Meas. Tech.
High-Throughput Screening Assay
Kd
10000±n/a nM
Citation
 Schmidt, AMRamasamy, RShekhtman, ARai, VManigrasso, MB Amino, amido and heterocyclic compounds as modulators of RAGE activity and uses thereof US Patent  US10729695 Publication Date 8/4/2020 
Target
Name:
Advanced glycosylation end product-specific receptor
Synonyms:
AGER RAGE_HUMAN | Receptor for advanced glycosylation end products
Type:
PROTEIN
Mol. Mass.:
42800.11
Organism:
Homo sapiens (Human)
Description:
ChEMBL_1339877
Residue:
404
  
Inhibitor
Name:
BDBM453300
Synonyms:
US10729695, Compound CD-18
Type:
Small organic molecule
Emp. Form.:
C22H21N3O
Mol. Mass.:
343.4216
SMILES:
OC(CN(c1ccccc1)c1ccccc1)Cn1cnc2ccccc12
: