Target
Advanced glycosylation end product-specific receptor
Ligand
BDBM453302
Substrate
Meas. Tech.
High-Throughput Screening Assay
Kd
10000±n/a nM
Citation
 Schmidt, AMRamasamy, RShekhtman, ARai, VManigrasso, MB Amino, amido and heterocyclic compounds as modulators of RAGE activity and uses thereof US Patent  US10729695 Publication Date 8/4/2020 
Target
Name:
Advanced glycosylation end product-specific receptor
Synonyms:
AGER RAGE_HUMAN | Receptor for advanced glycosylation end products
Type:
PROTEIN
Mol. Mass.:
42800.11
Organism:
Homo sapiens (Human)
Description:
ChEMBL_1339877
Residue:
404
  
Inhibitor
Name:
BDBM453302
Synonyms:
US10729695, Compound CD-20
Type:
Small organic molecule
Emp. Form.:
C16H19N3OS
Mol. Mass.:
301.407
SMILES:
CC(C)CCC1C(C)=NN(C1=O)c1nc2ccccc2s1
: