Target
N-formyl peptide receptor 2
Ligand
BDBM350572
Substrate
Meas. Tech.
FLIPR
EC50
15.0±n/a nM
Citation
 Viswanath, VBeard, RLDonello, JEHsia, E Use of agonists of formyl peptide receptor 2 for treating dermatological diseases US Patent  US10799518 Publication Date 10/13/2020 
Target
Name:
N-formyl peptide receptor 2
Synonyms:
ALXR, FPRL1, FPR2 FPR2 FPRH1 Formyl Peptide Receptor-Like 1 LXA4 receptor Lipoxin A4 receptor RFP | hFPRL
Type:
G Protein-Coupled Receptor (GPCR)
Mol. Mass.:
38968.35
Organism:
Homo sapiens (Human)
Description:
P25090
Residue:
351
  
Inhibitor
Name:
BDBM350572
Synonyms:
N-(4-bromophenyl)-7,7- dimethylbicyclo[2.2.1]heptane- 2,3-dicarboxamide US10434112, Compound 34 | US10799518, Compound 34
Type:
Small organic molecule
Emp. Form.:
C17H21BrN2O2
Mol. Mass.:
365.265
SMILES:
CC1(C)C2CCC1C(C2C(N)=O)C(=O)Nc1ccc(Br)cc1
: