Target
Cyclin-dependent kinase 12
Ligand
BDBM478485
Substrate
Meas. Tech.
Biochemical Assay for CDK12 (Kd Determination)
Kd
63.0±n/a nM
Citation
 Poddutoori, RSamajdar, SMukherjee, S Substituted pyrazole derivatives as selective CDK12/13 inhibitors US Patent  US10894786 Publication Date 1/19/2021 
Target
Name:
Cyclin-dependent kinase 12
Synonyms:
2.7.11.22 CDC2-related protein kinase 7 CDK12_HUMAN CRKRS Cell division cycle 2-related protein kinase 7 Cyclin-dependent kinase 12 hCDK12
Type:
PROTEIN
Mol. Mass.:
164218.64
Organism:
Homo sapiens
Description:
ChEMBL_117739
Residue:
1490
  
Inhibitor
Name:
BDBM478485
Synonyms:
(S)-2-(4-(1-acryloyl-1,2,3,6-tetrahydropyridin-4-yl)phenyl)-N-(5-cyclopropyl- 1H-pyrazol-3-yl)propanamide | US10894786, Comp. No 2
Type:
Small organic molecule
Emp. Form.:
C23H26N4O2
Mol. Mass.:
390.4781
SMILES:
C[C@H](C(=O)Nc1cc([nH]n1)C1CC1)c1ccc(cc1)C1=CCN(CC1)C(=O)C=C
: