Target
Eukaryotic translation initiation factor 2-alpha kinase 3
Ligand
BDBM482171
Substrate
Meas. Tech.
ADP-Glo Kinase Assay
IC50
<16±n/a nM
Citation
 Bindi, SCarenzi, DMotto, IPulici, M N-(substituted-phenyl)-sulfonamide derivatives as kinase inhibitors US Patent  US10918642 Publication Date 2/16/2021 
Target
Name:
Eukaryotic translation initiation factor 2-alpha kinase 3
Synonyms:
E2AK3_HUMAN HsPEK PERK Pancreatic endoplasmic reticulum kinase (PERK)
Type:
Enzyme
Mol. Mass.:
125190.66
Organism:
Homo sapiens (Human)
Description:
Q9NZJ5
Residue:
1116
  
Inhibitor
Name:
BDBM482171
Synonyms:
N-[3-(4-Amino-7-methyl-7H-pyrrolo[2,3-d]pyrimidin-5-yl)-2-fluoro-phenyl]-3-chloro-benzenesulfonamide | US10918642, Cmpd # 13
Type:
Small organic molecule
Emp. Form.:
C19H15Cl2N5O2S
Mol. Mass.:
448.326
SMILES:
Cn1cc(-c2cccc(NS(=O)(=O)c3cccc(Cl)c3)c2Cl)c2c(N)ncnc12
: