Target
Eukaryotic translation initiation factor 2-alpha kinase 3
Ligand
BDBM482177
Substrate
Meas. Tech.
ADP-Glo Kinase Assay
IC50
33±n/a nM
Citation
 Bindi, SCarenzi, DMotto, IPulici, M N-(substituted-phenyl)-sulfonamide derivatives as kinase inhibitors US Patent  US10918642 Publication Date 2/16/2021 
Target
Name:
Eukaryotic translation initiation factor 2-alpha kinase 3
Synonyms:
E2AK3_HUMAN HsPEK PERK Pancreatic endoplasmic reticulum kinase (PERK)
Type:
Enzyme
Mol. Mass.:
125190.66
Organism:
Homo sapiens (Human)
Description:
Q9NZJ5
Residue:
1116
  
Inhibitor
Name:
BDBM482177
Synonyms:
N-[3-(4-Amino-7-methyl-7H-pyrrolo[2,3-d]pyrimidin-5-yl)-2-fluoro-phenyl]-4-nitro-benzenesulfonamide US11491158, Cmpd 19
Type:
Small organic molecule
Emp. Form.:
C19H15FN6O4S
Mol. Mass.:
442.424
SMILES:
Cn1cc(-c2cccc(NS(=O)(=O)c3ccc(cc3)[N+]([O-])=O)c2F)c2c(N)ncnc12
: