Target
Eukaryotic translation initiation factor 2-alpha kinase 3
Ligand
BDBM482183
Substrate
Meas. Tech.
ADP-Glo Kinase Assay
IC50
<16±n/a nM
Citation
 Bindi, SCarenzi, DMotto, IPulici, M N-(substituted-phenyl)-sulfonamide derivatives as kinase inhibitors US Patent  US10918642 Publication Date 2/16/2021 
Target
Name:
Eukaryotic translation initiation factor 2-alpha kinase 3
Synonyms:
E2AK3_HUMAN HsPEK PERK Pancreatic endoplasmic reticulum kinase (PERK)
Type:
Enzyme
Mol. Mass.:
125190.66
Organism:
Homo sapiens (Human)
Description:
Q9NZJ5
Residue:
1116
  
Inhibitor
Name:
BDBM482183
Synonyms:
N-[3-(4-Amino-7-methyl-7H-pyrrolo[2,3-d]pyrimidin-5-yl)-2-fluoro-phenyl]-5-chloro-2-fluoro-4-methoxy-benzenesulfonamide US11491158, Cmpd 24
Type:
Small organic molecule
Emp. Form.:
C20H16ClF2N5O3S
Mol. Mass.:
479.888
SMILES:
COc1cc(F)c(cc1Cl)S(=O)(=O)Nc1cccc(-c2cn(C)c3ncnc(N)c23)c1F
: