Target
Eukaryotic translation initiation factor 2-alpha kinase 3
Ligand
BDBM482203
Substrate
Meas. Tech.
ADP-Glo Kinase Assay
IC50
33±n/a nM
Citation
 Bindi, SCarenzi, DMotto, IPulici, M N-(substituted-phenyl)-sulfonamide derivatives as kinase inhibitors US Patent  US10918642 Publication Date 2/16/2021 
Target
Name:
Eukaryotic translation initiation factor 2-alpha kinase 3
Synonyms:
E2AK3_HUMAN HsPEK PERK Pancreatic endoplasmic reticulum kinase (PERK)
Type:
Enzyme
Mol. Mass.:
125190.66
Organism:
Homo sapiens (Human)
Description:
Q9NZJ5
Residue:
1116
  
Inhibitor
Name:
BDBM482203
Synonyms:
5-Bromo-thiophene-2-sulfonic acid [3-(4-amino-7-methyl-7H-pyrrolo[2,3-d]pyrimidin-5-yl)-2-fluoro-phenyl]-amide US11491158, Cmpd 48
Type:
Small organic molecule
Emp. Form.:
C17H13BrFN5O2S2
Mol. Mass.:
482.35
SMILES:
Cn1cc(-c2cccc(NS(=O)(=O)c3ccc(Br)s3)c2F)c2c(N)ncnc12
: