Target
Eukaryotic translation initiation factor 2-alpha kinase 3
Ligand
BDBM482211
Substrate
Meas. Tech.
ADP-Glo Kinase Assay
IC50
33±n/a nM
Citation
 Bindi, SCarenzi, DMotto, IPulici, M N-(substituted-phenyl)-sulfonamide derivatives as kinase inhibitors US Patent  US10918642 Publication Date 2/16/2021 
Target
Name:
Eukaryotic translation initiation factor 2-alpha kinase 3
Synonyms:
E2AK3_HUMAN HsPEK PERK Pancreatic endoplasmic reticulum kinase (PERK)
Type:
Enzyme
Mol. Mass.:
125190.66
Organism:
Homo sapiens (Human)
Description:
Q9NZJ5
Residue:
1116
  
Inhibitor
Name:
BDBM482211
Synonyms:
N-[3-(4-Amino-1-piperidin-4-yl-1H-pyrazolo[3,4-d]pyrimidin-3-yl)-2-fluoro-phenyl]-5-chloro-2-fluoro-4-methoxy-benzenesulfonamide US11491158, Cmpd 62
Type:
Small organic molecule
Emp. Form.:
C23H22ClF2N7O3S
Mol. Mass.:
549.981
SMILES:
COc1cc(F)c(cc1Cl)S(=O)(=O)Nc1cccc(-c2nn(C3CCNCC3)c3ncnc(N)c23)c1F
: