Target
Eukaryotic translation initiation factor 2-alpha kinase 3
Ligand
BDBM482213
Substrate
Meas. Tech.
ADP-Glo Kinase Assay
IC50
33±n/a nM
Citation
 Bindi, SCarenzi, DMotto, IPulici, M N-(substituted-phenyl)-sulfonamide derivatives as kinase inhibitors US Patent  US10918642 Publication Date 2/16/2021 
Target
Name:
Eukaryotic translation initiation factor 2-alpha kinase 3
Synonyms:
E2AK3_HUMAN HsPEK PERK Pancreatic endoplasmic reticulum kinase (PERK)
Type:
Enzyme
Mol. Mass.:
125190.66
Organism:
Homo sapiens (Human)
Description:
Q9NZJ5
Residue:
1116
  
Inhibitor
Name:
BDBM482213
Synonyms:
N-[3-(4-Amino-7-piperidin-4-yl-7H-pyrrolo[2,3-d]pyrimidin-5-yl)-2-fluoro-phenyl]-4-methoxy-3-methyl-benzenesulfonamide US11491158, Cmpd 64
Type:
Small organic molecule
Emp. Form.:
C25H27FN6O3S
Mol. Mass.:
510.584
SMILES:
COc1ccc(cc1C)S(=O)(=O)Nc1cccc(-c2cn(C3CCNCC3)c3ncnc(N)c23)c1F
: