Target
Eukaryotic translation initiation factor 2-alpha kinase 3
Ligand
BDBM482223
Substrate
Meas. Tech.
Quantification of the Phosphorylated Product Formed from the Kinase Reaction in Presence of ATP
IC50
33±n/a nM
Citation
 Bindi, SCarenzi, DMotto, IPulici, M N-(substituted-phenyl)-sulfonamide derivatives as kinase inhibitors US Patent  US10918642 Publication Date 2/16/2021 
Target
Name:
Eukaryotic translation initiation factor 2-alpha kinase 3
Synonyms:
E2AK3_HUMAN HsPEK PERK Pancreatic endoplasmic reticulum kinase (PERK)
Type:
Enzyme
Mol. Mass.:
125190.66
Organism:
Homo sapiens (Human)
Description:
Q9NZJ5
Residue:
1116
  
Inhibitor
Name:
BDBM482223
Synonyms:
5-Bromo-thiophene-2-sulfonic acid {3-[4-amino-7-(1-methyl-piperidin-4-yl)-7H-pyrrolo[2,3-d]pyrimidin-5-yl]-2-fluoro-phenyl}-amide US11491158, Cmpd 77
Type:
Small organic molecule
Emp. Form.:
C22H22BrFN6O2S2
Mol. Mass.:
565.481
SMILES:
CN1CCC(CC1)n1cc(-c2cccc(NS(=O)(=O)c3ccc(Br)s3)c2F)c2c(N)ncnc12
: