Target
Tyrosine-protein kinase JAK2 [831-1132]
Ligand
BDBM488667
Substrate
Meas. Tech.
Enzyme Inhibition Assay
IC50
1600±n/a nM
Citation
 Nilsson, KMAstrand, ABBerggren, AIJohansson, JRLepisto, MJKawatkar, SPSu, QKettle, JG JAK1 selective inhibitors US Patent  US10961228 Publication Date 3/30/2021 
Target
Name:
Tyrosine-protein kinase JAK2 [831-1132]
Synonyms:
JAK2 JAK2_HUMAN | Tyrosine-protein kinase JAK2 (aa 831-1132)
Type:
Enzyme Catalytic Domain
Mol. Mass.:
35337.99
Organism:
Homo sapiens (Human)
Description:
O60674[831-1132]
Residue:
302
  
Inhibitor
Name:
BDBM488667
Synonyms:
(R)-N-(3-(2-(3- cyclopropylsulfonyl)- 2-fluorophenylamino)- 5-methylpyrimidin-4- yl)-1H-indol-7-yl)-2- (4-methylpiperazin-1- yl)propanamide | US10961228, Example 4
Type:
Small organic molecule
Emp. Form.:
C30H34FN7O3S
Mol. Mass.:
591.699
SMILES:
C[C@@H](N1CCN(C)CC1)C(=O)Nc1cccc2c(c[nH]c12)-c1nc(Nc2cccc(c2F)S(=O)(=O)C2CC2)ncc1C
: