Target
Induced myeloid leukemia cell differentiation protein Mcl-1 [171-327]
Ligand
BDBM449627
Substrate
Meas. Tech.
AlphaLISA Assay
IC50
0.018±n/a nM
Citation
Target
Name:
Induced myeloid leukemia cell differentiation protein Mcl-1 [171-327]
Synonyms:
BCL2L3 MCL1 Myeloid cell leukemia 1 (Mcl-1)
Type:
Enzyme Catalytic Domain
Mol. Mass.:
17896.13
Organism:
Homo sapiens (Human)
Description:
Q07820[171-327]
Residue:
157
  
Inhibitor
Name:
BDBM449627
Synonyms:
US10703733, Example 240 | US10988451, Example 240
Type:
Small organic molecule
Emp. Form.:
C38H48ClN5O6S
Mol. Mass.:
738.336
SMILES:
CO[C@H]1CCC[C@H](C)C[S@@](=O)(NC(=O)c2cn(C)nc2OC)=NC(=O)c2ccc3OC[C@]4(CCCc5cc(Cl)ccc45)CN(C[C@@H]4CC[C@@H]14)c3c2
: