Target
Protein mono-ADP-ribosyltransferase TIPARP
Ligand
BDBM431547
Substrate
Meas. Tech.
Enzymatic Assay
IC50
<100±n/a nM
Citation
 Vasbinder, MMSchenkel, LBSwinger, KKKuntz, KW Pyridazinones as PARP7 inhibitors US Patent  US11014913 Publication Date 5/25/2021 
Target
Name:
Protein mono-ADP-ribosyltransferase TIPARP
Synonyms:
ADP-ribosyltransferase diphtheria toxin-like 14 PARP-7 PARPT_HUMAN TCDD-inducible poly [ADP-ribose] polymerase | TIPARP
Type:
Protein
Mol. Mass.:
76228.44
Organism:
Human
Description:
Q7Z3E1
Residue:
657
  
Inhibitor
Name:
BDBM431547
Synonyms:
US10550105, Example 492 US11014913, Example 492
Type:
Small organic molecule
Emp. Form.:
C28H29F3N8O3
Mol. Mass.:
582.5769
SMILES:
FC(F)(F)c1c(cn[nH]c1=O)N1Cc2cccc(OCCNCCC(=O)N3CCN(CC3)c3ccc(cn3)C#N)c2C1
: