Target
Replicase polyprotein 1ab
Ligand
BDBM11249
Substrate
fluorogenic substrate peptide
Meas. Tech.
SARS-CoV 3CL Protease Inhibition Assay
pH
7±n/a
Temperature
298.15±n/a K
IC50
80000±n/a nM
Citation
 Shie, JJFang, JMKuo, THKuo, CJLiang, PHHuang, HJWu, YTJan, JTCheng, YSWong, CH Inhibition of the severe acute respiratory syndrome 3CL protease by peptidomimetic alpha,beta-unsaturated esters. Bioorg Med Chem 13:5240-52 (2005)  
Target
Name:
Replicase polyprotein 1ab
Synonyms:
3C-like proteinase 3C-like proteinase (SARS-CoV 3Cpro) 3CLp GFL Guanine-N7 methyltransferase Helicase Leader protein Non-structural protein 10 Non-structural protein 3 Non-structural protein 6 Non-structural protein 8 ORF1ab polyprotein PL2-PRO Pol R1AB_SARS RdRp SARS coronavirus main proteinase nsp1 nsp12 nsp14 nsp16 nsp3 nsp5 nsp7 nsp9 pp1ab | rep
Type:
Protein
Mol. Mass.:
790250.81
Organism:
Human SARS coronavirus (SARS-CoV) (Severe acute respiratory syndrome coronavirus)
Description:
P0C6X7
Residue:
7073
  
Inhibitor
Name:
BDBM11249
Synonyms:
AG7088 analogue 2c | ethyl (2E,4S)-4-[(2S)-2-[(2S)-3-methyl-2-[(5-methyl-1,2-oxazol-3-yl)formamido]butanamido]-3-phenylpropanamido]-5-[(3S)-2-oxopyrrolidin-3-yl]pent-2-enoate
Type:
Small organic molecule
Emp. Form.:
C30H39N5O7
Mol. Mass.:
581.66
SMILES:
CCOC(=O)\C=C\[C@H](C[C@@H]1CCNC1=O)NC(=O)[C@H](Cc1ccccc1)NC(=O)[C@@H](NC(=O)c1cc(C)on1)C(C)C
:
Substrate
Name:
fluorogenic substrate peptide
Synonyms:
Type:
Peptide
Mol. Mass.:
2662.93
Organism:
Description:
Residue:
24