Target
Corticotropin-releasing factor receptor 1
Ligand
BDBM29434
Substrate
125I-Tyr(0)-ovine-CRF
Meas. Tech.
In Vitro Binding Autoradiography
pH
7.2±n/a
Temperature
296.15±n/a K
IC50
4.2±0.4 nM
Citation
 Gilligan, PJHe, LClarke, TTivitmahaisoon, PLelas, SLi, YWHeman, KFitzgerald, LMiller, KZhang, GMarshall, AKrause, CMcElroy, JWard, KShen, HWong, HGrossman, SNemeth, GZaczek, RArneric, SPHartig, PRobertson, DWTrainor, G 8-(4-Methoxyphenyl)pyrazolo[1,5-a]-1,3,5-triazines: selective and centrally active corticotropin-releasing factor receptor-1 (CRF1) antagonists. J Med Chem 52:3073-83 (2009)  
Target
Name:
Corticotropin-releasing factor receptor 1
Synonyms:
CRF-R CRFR1_RAT Corticotropin releasing factor receptor Corticotropin-releasing Factor Receptor 1 Crhr | Crhr1
Type:
G Protein-Coupled Receptor (GPCR)
Mol. Mass.:
47870.75
Organism:
Rattus norvegicus (rat)
Description:
Receptor binding assays were performed using rat cortex homogenate.
Residue:
415
  
Inhibitor
Name:
BDBM29434
Synonyms:
Pyrazolo[1,5-a]-1,3,5-triazine, 12-3
Type:
Small organic molecule
Emp. Form.:
C21H29N5O3
Mol. Mass.:
399.4867
SMILES:
COCCN(CCOC)c1nc(C)nc2c(c(C)nn12)-c1ccc(OC)cc1C
:
Substrate
Name:
125I-Tyr(0)-ovine-CRF
Synonyms:
Ovine Tyr-CRF | oCRF
Type:
radiolabeled substrate
Mol. Mass.:
4833.46
Organism:
Ovis aries (sheep)
Description:
Residue:
42