Target
cAMP-specific 3',5'-cyclic phosphodiesterase 4D
Ligand
BDBM31648
Substrate
BDBM10851
Meas. Tech.
Enzyme Inhibition Assay
pH
7.5±n/a
Temperature
296.15±n/a K
IC50
126±n/a nM
Citation
 Kranz, MWall, MEvans, BMiah, ABallantine, SDelves, CDombroski, BGross, JSchneck, JVilla, JPNeu, MSomers, DO Identification of PDE4B Over 4D subtype-selective inhibitors revealing an unprecedented binding mode. Bioorg Med Chem 17:5336-41 (2009)  
Target
Name:
cAMP-specific 3',5'-cyclic phosphodiesterase 4D
Synonyms:
3',5'-cyclic phosphodiesterase PDE43 PDE4D_HUMAN | Phosphodiesterase 4D
Type:
Protein
Mol. Mass.:
91092.69
Organism:
Homo sapiens (Human)
Description:
Q08499
Residue:
809
  
Inhibitor
Name:
BDBM31648
Synonyms:
tetrahydrobenzothiophene (THBT), 22
Type:
Small organic molecule
Emp. Form.:
C20H23N3O4S
Mol. Mass.:
401.479
SMILES:
CC(C)(C)C1CCc2c(C1)sc(NC(=O)c1ccccc1[N+]([O-])=O)c2C(N)=O
:
Substrate
Name:
BDBM10851
Synonyms:
(4aR,6R,7R,7aS)-6-(6-amino-9H-purin-9-yl)-2,7-dihydroxy-hexahydro-1,3,5,2-furo[3,2-d][1,3,2]dioxaphosphinin-2-one ADENOSINE-3 ,5 -CYCLIC-MONOPHOSPHATE cAMP | cid_23902375
Type:
Small organic molecule
Emp. Form.:
C10H12N5O6P
Mol. Mass.:
329.2059
SMILES:
Nc1ncnc2n(cnc12)[C@@H]1O[C@@H]2COP(O)(=O)O[C@H]2[C@H]1O
: