Target
Aldo-keto reductase family 1 member C2
Ligand
BDBM50277998
Substrate
Meas. Tech.
ChEMBL_1774822 (CHEMBL4231814)
IC50
73230±n/a nM
Citation
 Pippione, ACCarnovale, IMBonanni, DSini, MGoyal, PMarini, EPors, KAdinolfi, SZonari, DFestuccia, CWahlgren, WYFriemann, RBagnati, RBoschi, DOliaro-Bosso, SLolli, ML Potent and selective aldo-keto reductase 1C3 (AKR1C3) inhibitors based on the benzoisoxazole moiety: application of a bioisosteric scaffold hopping approach to flufenamic acid. Eur J Med Chem 150:930-945 (2018)  
Target
Name:
Aldo-keto reductase family 1 member C2
Synonyms:
3-alpha-HSD3 AK1C2_HUMAN Aldo-keto reductase family 1 member C2 (AK1C2) Aldo-keto reductase family 1 member C2 (AKR1C2) DD-2 DDH2 Dihydrodiol dehydrogenase/bile acid-binding protein Type III 3-alpha-hydroxysteroid dehydrogenase
Type:
Enzyme
Mol. Mass.:
36739.89
Organism:
Homo sapiens (Human)
Description:
Residue:
323
  
Inhibitor
Name:
BDBM50277998
Synonyms:
CHEMBL4174786
Type:
Small organic molecule
Emp. Form.:
C18H15F3N4O3
Mol. Mass.:
392.3319
SMILES:
COc1ccc(Cn2nnc(O)c2C(=O)Nc2cccc(c2)C(F)(F)F)cc1
: