Target
Potassium voltage-gated channel subfamily H member 2
Ligand
BDBM50491223
Substrate
Meas. Tech.
ChEMBL_960200 (CHEMBL2382572)
IC50
3200±n/a nM
Citation
 Ginman, TViklund, JMalmström, JBlid, JEmond, RForsblom, RJohansson, AKers, ALake, FSehgelmeble, FSterky, KJBergh, MLindgren, AJohansson, PJeppsson, FFälting, JGravenfors, YRahm, F Core refinement toward permeable ?-secretase (BACE-1) inhibitors with low hERG activity. J Med Chem 56:4181-205 (2013)  
Target
Name:
Potassium voltage-gated channel subfamily H member 2
Synonyms:
1,3-beta-glucan synthase component GLS2 ERG Eag-related protein 1 Ether-a-go-go-related gene (HERG) Ether-a-go-go-related gene potassium channel 1 Ether-a-go-go-related gene potassium channel 1 (hERG1) Ether-a-go-go-related protein 1 H-ERG KCNH2 Potassium voltage-gated channel subfamily H member 2 (hERG) Voltage-gated potassium channel subunit Kv11.1 hERG Potassium Channel 1 | putative potassium channel subunit
Type:
Multi-pass membrane protein
Mol. Mass.:
126672.65
Organism:
Homo sapiens (Human)
Description:
Q12809
Residue:
1159
  
Inhibitor
Name:
BDBM50491223
Synonyms:
CHEMBL2380459
Type:
Small organic molecule
Emp. Form.:
C23H23N3O2
Mol. Mass.:
373.4476
SMILES:
COC1CC(N=C1N)(c1ccc(OC)cc1)c1cccc(c1)-c1cccnc1
: