Target
Adenosine receptor A2a
Ligand
BDBM50531422
Substrate
Meas. Tech.
ChEMBL_1920172 (CHEMBL4423017)
Ki
>1000±n/a nM
Citation
 Härter, MKalthof, BDelbeck, MLustig, KGerisch, MSchulz, SKast, RMeibom, DLindner, N Novel non-xanthine antagonist of the A Eur J Med Chem 163:763-778 (2019)  
Target
Name:
Adenosine receptor A2a
Synonyms:
A2A adenosine receptor (hA2A) ADENOSINE A2 ADORA2 Adenosine A2A receptor (A2AAR)
Type:
G Protein-Coupled Receptor (GPCR)
Mol. Mass.:
44716.46
Organism:
Homo sapiens (Human)
Description:
P29274
Residue:
412
  
Inhibitor
Name:
BDBM50531422
Synonyms:
CHEMBL4522981
Type:
Small organic molecule
Emp. Form.:
C18H22F3N3O4S
Mol. Mass.:
433.445
SMILES:
CCn1c(=O)n(CCC(F)(F)F)c2sc(C(=O)N3CCC(O)CC3)c(C)c2c1=O
: