Target
Large neutral amino acids transporter small subunit 1
Ligand
BDBM50532381
Substrate
Meas. Tech.
ChEMBL_1923023 (CHEMBL4425979)
IC50
790±n/a nM
Citation
 Huttunen, KMGynther, MHuttunen, JPuris, ESpicer, JADenny, WA A Selective and Slowly Reversible Inhibitor of l-Type Amino Acid Transporter 1 (LAT1) Potentiates Antiproliferative Drug Efficacy in Cancer Cells. J Med Chem 59:5740-51 (2016)  
Target
Name:
Large neutral amino acids transporter small subunit 1
Synonyms:
4F2 LC 4F2LC CD98LC Integral membrane protein E16 LAT1 Large neutral amino acids transporter small subunit 1 SLC7A5 hLAT1 | y+ system cationic amino acid transporter
Type:
PROTEIN
Mol. Mass.:
55013.61
Organism:
Homo sapiens (Human)
Description:
ChEMBL_100160
Residue:
507
  
Inhibitor
Name:
BDBM50532381
Synonyms:
CHEMBL4538666
Type:
Small organic molecule
Emp. Form.:
C23H19Cl2N3O4
Mol. Mass.:
472.321
SMILES:
N[C@@H](Cc1cc(Cl)c(OCc2cc(N)cc3nc(oc23)-c2ccccc2)c(Cl)c1)C(O)=O
: