Target
DNA topoisomerase 1
Ligand
BDBM50092821
Substrate
Meas. Tech.
ChEMBL_208433 (CHEMBL814847)
IC50
4000±n/a nM
Citation
 Kim, DKRyu, DHLee, JYLee, NKim, YWKim, JSChang, KIm, GJKim, TKChoi, WS Synthesis and biological evaluation of novel A-ring modified hexacyclic camptothecin analogues. J Med Chem 44:1594-602 (2001)  
Target
Name:
DNA topoisomerase 1
Synonyms:
DNA topoisomerase I Top-1 | Top1
Type:
PROTEIN
Mol. Mass.:
90922.04
Organism:
Mus musculus
Description:
ChEMBL_208411
Residue:
767
  
Inhibitor
Name:
BDBM50092821
Synonyms:
(R)-4-Ethyl-4-methyl-1,4a,12,13a-tetrahydro-4H-2-oxa-6,12a-diaza-dibenzo[b,h]fluorene-3,13-dione (S)-4,11-Diethyl-4-hydroxy-1,12-dihydro-4H-2-oxa-6,12a-diaza-dibenzo[b,h]fluorene-3,13-dione 4,11-Diethyl-4,9-dihydroxy-1,12-dihydro-4H-2-oxa-6,12a-diaza-dibenzo[b,h]fluorene-3,13-dione (SN-38) 4,11-diethyl-4,9-dihydroxy-(4S)-3,4,12,14-tetrahydro-1H-pyrano[3',4':6,7]indolizino[1,2-b]quinoline-3,14-dione 7-Ethyl-10-hydroxy-20(S)-camptothecin CHEMBL837 | SN-38
Type:
Small organic molecule
Emp. Form.:
C22H20N2O4
Mol. Mass.:
376.4052
SMILES:
CCc1c2Cn3c(cc4c(COC(=O)[C@]4(O)CC)c3=O)-c2nc2ccccc12
: