Target
Dual specificity protein phosphatase 1
Ligand
BDBM24776
Substrate
Meas. Tech.
ChEMBL_565116 (CHEMBL965760)
IC50
8450±n/a nM
Citation
 Cao, SMurphy, BTFoster, CLazo, JSKingston, DG Bioactivities of simplified adociaquinone B and naphthoquinone derivatives against Cdc25B, MKP-1, and MKP-3 phosphatases. Bioorg Med Chem 17:2276-81 (2009)  
Target
Name:
Dual specificity protein phosphatase 1
Synonyms:
3ch134 Dusp1 Ptpn10 | Ptpn16
Type:
PROTEIN
Mol. Mass.:
39372.46
Organism:
Mus musculus
Description:
ChEMBL_565116
Residue:
367
  
Inhibitor
Name:
BDBM24776
Synonyms:
1,4-Naphthoquinone 1,4-dihydronaphthalene-1,4-dione CHEMBL55934
Type:
Small organic molecule
Emp. Form.:
C10H6O2
Mol. Mass.:
158.1534
SMILES:
O=C1C=CC(=O)c2ccccc12
: