Target
DNA (cytosine-5)-methyltransferase 3B
Ligand
BDBM50294482
Substrate
Meas. Tech.
ChEMBL_575566 (CHEMBL1036409)
IC50
300±n/a nM
Citation
 Saavedra, OMIsakovic, LLlewellyn, DBZhan, LBernstein, NClaridge, SRaeppel, FVaisburg, AElowe, NPetschner, AJRahil, JBeaulieu, NMacLeod, ARDelorme, DBesterman, JMWahhab, A SAR around (l)-S-adenosyl-l-homocysteine, an inhibitor of human DNA methyltransferase (DNMT) enzymes. Bioorg Med Chem Lett 19:2747-51 (2009)  
Target
Name:
DNA (cytosine-5)-methyltransferase 3B
Synonyms:
DNM3B_HUMAN | DNMT3B
Type:
PROTEIN
Mol. Mass.:
95771.12
Organism:
Homo sapiens (Human)
Description:
ChEMBL_1473708
Residue:
853
  
Inhibitor
Name:
BDBM50294482
Synonyms:
CHEMBL552309 | S-tubercidinylhomocysteine
Type:
Small organic molecule
Emp. Form.:
C15H21N5O5S
Mol. Mass.:
383.423
SMILES:
N[C@@H](CCSC[C@H]1O[C@H]([C@H](O)[C@@H]1O)n1ccc2c(N)ncnc12)C(O)=O
: