Target
DNA (cytosine-5)-methyltransferase 1
Ligand
BDBM50294575
Substrate
Meas. Tech.
ChEMBL_575599 (CHEMBL1036444)
IC50
36000±n/a nM
Citation
 Isakovic, LSaavedra, OMLlewellyn, DBClaridge, SZhan, LBernstein, NVaisburg, AElowe, NPetschner, AJRahil, JBeaulieu, NGauthier, FMacLeod, ARDelorme, DBesterman, JMWahhab, A Constrained (l-)-S-adenosyl-l-homocysteine (SAH) analogues as DNA methyltransferase inhibitors. Bioorg Med Chem Lett 19:2742-6 (2009)  
Target
Name:
DNA (cytosine-5)-methyltransferase 1
Synonyms:
AIM CXXC9 DNA (cytosine-5)-methyltransferase 1 isoform b DNA methyltransferase HsaI DNMT1 M.HsaI | MCMT
Type:
Enzyme
Mol. Mass.:
183184.85
Organism:
Homo sapiens (Human)
Description:
P26358
Residue:
1616
  
Inhibitor
Name:
BDBM50294575
Synonyms:
(2S,3R,4S,5S)-2-(6-amino-2-chloro-9H-purin-9-yl)-5-(((S)-pyrrolidin-3-ylthio)methyl)tetrahydrofuran-3,4-diol | CHEMBL538627
Type:
Small organic molecule
Emp. Form.:
C14H19ClN6O3S
Mol. Mass.:
386.857
SMILES:
Nc1nc(Cl)nc2n(cnc12)[C@@H]1O[C@H](CS[C@H]2CCNC2)[C@@H](O)[C@H]1O
: