Target
DNA (cytosine-5)-methyltransferase 3B
Ligand
BDBM50294570
Substrate
Meas. Tech.
ChEMBL_575600 (CHEMBL1036445)
IC50
66000±n/a nM
Citation
 Isakovic, LSaavedra, OMLlewellyn, DBClaridge, SZhan, LBernstein, NVaisburg, AElowe, NPetschner, AJRahil, JBeaulieu, NGauthier, FMacLeod, ARDelorme, DBesterman, JMWahhab, A Constrained (l-)-S-adenosyl-l-homocysteine (SAH) analogues as DNA methyltransferase inhibitors. Bioorg Med Chem Lett 19:2742-6 (2009)  
Target
Name:
DNA (cytosine-5)-methyltransferase 3B
Synonyms:
DNM3B_HUMAN | DNMT3B
Type:
PROTEIN
Mol. Mass.:
95771.12
Organism:
Homo sapiens (Human)
Description:
ChEMBL_1473708
Residue:
853
  
Inhibitor
Name:
BDBM50294570
Synonyms:
(2R,3R,4S,5S)-2-(6-amino-9H-purin-9-yl)-5-(((1R,2S)-2-aminocyclopentylthio)methyl)tetrahydrofuran-3,4-diol | CHEMBL559281
Type:
Small organic molecule
Emp. Form.:
C15H22N6O3S
Mol. Mass.:
366.439
SMILES:
N[C@H]1CCC[C@H]1SC[C@H]1O[C@H]([C@H](O)[C@@H]1O)n1cnc2c(N)ncnc12
: