Target
Acetylcholinesterase
Ligand
BDBM10620
Substrate
Meas. Tech.
ChEMBL_751131 (CHEMBL1787068)
IC50
37±n/a nM
Citation
 Tasso, BCatto, MNicolotti, ONovelli, FTonelli, MGiangreco, IPisani, LSparatore, ABoido, VCarotti, ASparatore, F Quinolizidinyl derivatives of bi- and tricyclic systems as potent inhibitors of acetyl- and butyrylcholinesterase with potential in Alzheimer's disease. Eur J Med Chem 46:2170-84 (2011)  
Target
Name:
Acetylcholinesterase
Synonyms:
ACES_HUMAN Acetylcholinesterase (AChE) | Acetylcholinesterase (human AChE)
Type:
Enzyme
Mol. Mass.:
67792.70
Organism:
Homo sapiens (Human)
Description:
P22303
Residue:
614
  
Inhibitor
Name:
BDBM10620
Synonyms:
(S)-3-(1-(dimethylamino)ethyl)phenyl ethyl(methyl)carbamate 3-(1-(dimethylamino)ethyl)phenyl ethyl(methyl)carbamate CHEMBL636 Ethyl-methyl-carbamic acid 3-((R)-1-dimethylamino-ethyl)-phenyl ester Ethyl-methyl-carbamic acid 3-(1-dimethylamino-ethyl)-phenyl ester Rivastigmine SDZ-212-713 | SDZ-ENA-713
Type:
Small organic molecule
Emp. Form.:
C14H22N2O2
Mol. Mass.:
250.3367
SMILES:
[H][C@@](C)(N(C)C)c1cccc(OC(=O)N(C)CC)c1
: