Target
D(2) dopamine receptor
Ligand
BDBM50032522
Substrate
Meas. Tech.
ChEMBL_794949 (CHEMBL1936228)
Ki
302±n/a nM
Citation
 Cueva, JPChemel, BRJuncosa, JILill, MAWatts, VJNichols, DE Analogues of doxanthrine reveal differences between the dopamine D1 receptor binding properties of chromanoisoquinolines and hexahydrobenzo[a]phenanthridines. Eur J Med Chem 48:97-107 (2012)  
Target
Name:
D(2) dopamine receptor
Synonyms:
D(2) dopamine receptor DOPAMINE D2 Long DRD2 Dopamine D2 receptor Dopamine D2 receptor (D2R) Dopamine2-like | d2
Type:
Cell-surface receptors
Mol. Mass.:
50647.10
Organism:
Homo sapiens (Human)
Description:
P14416
Residue:
443
  
Inhibitor
Name:
BDBM50032522
Synonyms:
(6aR,12bS)-2-Methyl-5,6,6a,7,8,12b-hexahydro-benzo[a]phenanthridine-10,11-diol | CHEMBL319707
Type:
Small organic molecule
Emp. Form.:
C18H19NO2
Mol. Mass.:
281.349
SMILES:
Cc1ccc2CN[C@@H]3CCc4cc(O)c(O)cc4[C@H]3c2c1
: