Target
Aromatase
Ligand
BDBM10015
Substrate
Meas. Tech.
ChEMBL_808290 (CHEMBL1961307)
IC50
8±n/a nM
Citation
 Mayhoub, ASMarler, LKondratyuk, TPPark, EJPezzuto, JMCushman, M Optimization of the aromatase inhibitory activities of pyridylthiazole analogues of resveratrol. Bioorg Med Chem 20:2427-34 (2012)  
Target
Name:
Aromatase
Synonyms:
ARO1 CP19A_HUMAN CYP19 CYPXIX Cytochrome P450 19A1 Cytochrome P450-C19 (CYP19) FL cytokine receptor precursor | P-450AROM
Type:
Enzyme
Mol. Mass.:
57888.92
Organism:
Homo sapiens (Human)
Description:
P11511
Residue:
503
  
Inhibitor
Name:
BDBM10015
Synonyms:
2-[3-(1-cyano-1-methylethyl)-5-(1H-1,2,4-triazol-1-ylmethyl)phenyl]-2-methylpropanenitrile ANASTROZOLE NSC719344 | arimidex
Type:
Small organic molecule
Emp. Form.:
C17H19N5
Mol. Mass.:
293.3663
SMILES:
CC(C)(C#N)c1cc(Cn2cncn2)cc(c1)C(C)(C)C#N
: