Target
Methylated-DNA--protein-cysteine methyltransferase
Ligand
BDBM50068794
Substrate
Meas. Tech.
ChEMBL_144711 (CHEMBL751006)
IC50
5±n/a nM
Citation
 McElhinney, RSDonnelly, DJMcCormick, JEKelly, JWatson, AJRafferty, JAElder, RHMiddleton, MRWillington, MAMcMurry, TBMargison, GP Inactivation of O6-alkylguanine-DNA alkyltransferase. 1. Novel O6-(hetarylmethyl)guanines having basic rings in the side chain. J Med Chem 41:5265-71 (1999)  
Target
Name:
Methylated-DNA--protein-cysteine methyltransferase
Synonyms:
6-O-methylguanine-DNA methyltransferase MGMT_HUMAN
Type:
PROTEIN
Mol. Mass.:
21651.27
Organism:
Homo sapiens (Human)
Description:
ChEMBL_144711
Residue:
207
  
Inhibitor
Name:
BDBM50068794
Synonyms:
6-(5-Bromo-thiophen-2-ylmethoxy)-6,9-dihydro-1H-purin-2-ylamine | CHEMBL146769
Type:
Small organic molecule
Emp. Form.:
C10H10BrN5OS
Mol. Mass.:
328.188
SMILES:
NC1=Nc2nc[nH]c2C(N1)OCc1ccc(Br)s1
: