Target
Lysosomal alpha-glucosidase
Ligand
BDBM50398029
Substrate
Meas. Tech.
ChEMBL_873176 (CHEMBL2183407)
IC50
2370±n/a nM
Citation
 Xiao, JWestbroek, WMotabar, OLea, WAHu, XVelayati, AZheng, WSouthall, NGustafson, AMGoldin, ESidransky, ELiu, KSimeonov, ATamargo, RJRibes, AMatalonga, LFerrer, MMarugan, JJ Discovery of a novel noniminosugar acida glucosidase chaperone series. J Med Chem 55:7546-59 (2012)  
Target
Name:
Lysosomal alpha-glucosidase
Synonyms:
70 kDa lysosomal alpha-glucosidase Acid maltase Alpha glucosidase LYAG_HUMAN
Type:
PROTEIN
Mol. Mass.:
105312.45
Organism:
Homo sapiens (Human)
Description:
ChEMBL_1506060
Residue:
952
  
Inhibitor
Name:
BDBM50398029
Synonyms:
CHEMBL2180814
Type:
Small organic molecule
Emp. Form.:
C18H19N3O4S
Mol. Mass.:
373.426
SMILES:
Oc1ccc(cc1)N1CCN(CC1)S(=O)(=O)c1ccc2NC(=O)Cc2c1
: