Target
Thymidylate synthase
Ligand
BDBM50398391
Substrate
Meas. Tech.
ChEMBL_876162 (CHEMBL2183556)
Ki
64000±n/a nM
Citation
 Corona, PGibellini, FCavalli, ASaxena, PCarta, ALoriga, MLuciani, RPaglietti, GGuerrieri, DNerini, EGupta, SHannaert, VMichels, PAFerrari, SCosti, PM Structure-based selectivity optimization of piperidine-pteridine derivatives as potent Leishmania pteridine reductase inhibitors. J Med Chem 55:8318-29 (2012)  
Target
Name:
Thymidylate synthase
Synonyms:
TS TYMS Thymidylate synthase (TS) | Thymidylate synthase/GAR transformylase/AICAR transformylase
Type:
Enzyme
Mol. Mass.:
35718.07
Organism:
Homo sapiens (Human)
Description:
Residue:
313
  
Inhibitor
Name:
BDBM50398391
Synonyms:
CHEMBL2178602
Type:
Small organic molecule
Emp. Form.:
C23H28N8O4
Mol. Mass.:
480.5196
SMILES:
COC(=O)C1CCN(CC1)C(=O)c1ccc(cc1)N(CCO)Cc1cnc2nc(N)nc(N)c2n1
: