Target
Potassium voltage-gated channel subfamily H member 2
Ligand
BDBM50017705
Substrate
Meas. Tech.
ChEMBL_540080 (CHEMBL1036648)
IC50
32.36±n/a nM
Citation
 Coi, AMassarelli, ITestai, LCalderone, VBianucci, AM Identification of"toxicophoric" features for predicting drug-induced QT interval prolongation. Eur J Med Chem 43:2479-88 (2008)  
Target
Name:
Potassium voltage-gated channel subfamily H member 2
Synonyms:
1,3-beta-glucan synthase component GLS2 ERG Eag-related protein 1 Ether-a-go-go-related gene (HERG) Ether-a-go-go-related gene potassium channel 1 Ether-a-go-go-related gene potassium channel 1 (hERG1) Ether-a-go-go-related protein 1 H-ERG KCNH2 Potassium voltage-gated channel subfamily H member 2 (hERG) Voltage-gated potassium channel subunit Kv11.1 hERG Potassium Channel 1 | putative potassium channel subunit
Type:
Multi-pass membrane protein
Mol. Mass.:
126672.65
Organism:
Homo sapiens (Human)
Description:
Q12809
Residue:
1159
  
Inhibitor
Name:
BDBM50017705
Synonyms:
1-(1-(4-(4-fluorophenyl)-4-oxobutyl)-1,2,3,6-tetrahydropyridin-4-yl)-1H-benzo[d]imidazol-2(3H)-one 1-{1-[4-(4-Fluoro-phenyl)-4-oxo-butyl]-1,2,3,6-tetrahydro-pyridin-4-yl}-1,3-dihydro-benzoimidazol-2-one CHEMBL1108 Inapsine R-4749
Type:
Small organic molecule
Emp. Form.:
C22H22FN3O2
Mol. Mass.:
379.4274
SMILES:
Fc1ccc(cc1)C(=O)CCCN1CCC(=CC1)n1c2ccccc2[nH]c1=O
: