Target
Cathepsin K
Ligand
BDBM50418002
Substrate
Meas. Tech.
ChEMBL_719163 (CHEMBL1679622)
IC50
2±n/a nM
Citation
 Lainé, DPalovich, MMcCleland, BPetitjean, EDelhom, IXie, HDeng, JLin, GDavis, RJolit, ANevins, NZhao, BVilla, JSchneck, JMcDevitt, PMidgett, RKmett, CUmbrecht, SPeck, BDavis, ABBettoun, D Discovery of novel cyanamide-based inhibitors of cathepsin C. ACS Med Chem Lett 2:142-147 (2011)  
Target
Name:
Cathepsin K
Synonyms:
CATK_HUMAN CTSO Cathepsin O Cathepsin X
Type:
Enzyme
Mol. Mass.:
36975.68
Organism:
Homo sapiens (Human)
Description:
P43235
Residue:
329
  
Inhibitor
Name:
BDBM50418002
Synonyms:
CHEMBL1672427
Type:
Small organic molecule
Emp. Form.:
C11H11Br2N3O2S
Mol. Mass.:
409.097
SMILES:
Brc1ccc(Br)c(c1)S(=O)(=O)N[C@@H]1CCN(C1)C#N
: