Target
Amine oxidase [flavin-containing] A
Ligand
BDBM15581
Substrate
Meas. Tech.
ChEMBL_935778 (CHEMBL2317358)
IC50
12±n/a nM
Citation
 Rivara, SPiersanti, GBartoccini, FDiamantini, GPala, DRiccioni, TStasi, MACabri, WBorsini, FMor, MTarzia, GMinetti, P Synthesis of (E)-8-(3-chlorostyryl)caffeine analogues leading to 9-deazaxanthine derivatives as dual A(2A) antagonists/MAO-B inhibitors. J Med Chem 56:1247-61 (2013)  
Target
Name:
Amine oxidase [flavin-containing] A
Synonyms:
AOFA_HUMAN MAO-A Monoamine oxidase Monoamine oxidase type A (MAO A) Monoamine oxidase type A (MAOA)
Type:
Protein
Mol. Mass.:
59689.53
Organism:
Homo sapiens (Human)
Description:
P21397
Residue:
527
  
Inhibitor
Name:
BDBM15581
Synonyms:
CHEMBL8706 CLORGILINE N-[3-(2,4-dichlorophenoxy)propyl]-N-methyl-prop-2-yn-1-amine US9603833, Clorgyline | [3-(2,4-dichlorophenoxy)propyl](methyl)prop-2-yn-1-ylamine
Type:
Small organic molecule
Emp. Form.:
C13H15Cl2NO
Mol. Mass.:
272.17
SMILES:
CN(CCCOc1ccc(Cl)cc1Cl)CC#C
: