Target
Seed linoleate 13S-lipoxygenase-1
Ligand
BDBM50445691
Substrate
Meas. Tech.
ChEMBL_1284052 (CHEMBL3107209)
Ki
18000±n/a nM
Citation
 Ribeiro, DFreitas, MTomé, SMSilva, AMPorto, GCabrita, EJMarques, MMFernandes, E Inhibition of LOX by flavonoids: a structure-activity relationship study. Eur J Med Chem 72:137-45 (2014)  
Target
Name:
Seed linoleate 13S-lipoxygenase-1
Synonyms:
15-LOX 15-lipo-oxygenase (SLO) L-1 LOX1.1 Lipoxygenase (LOX) Lipoxygenase-1 | Seed lipoxygenase-1
Type:
Enzyme
Mol. Mass.:
94365.66
Organism:
Glycine max (soybean)
Description:
Residue:
839
  
Inhibitor
Name:
BDBM50445691
Synonyms:
CHEMBL243677
Type:
Small organic molecule
Emp. Form.:
C15H10O5
Mol. Mass.:
270.2369
SMILES:
Oc1ccc(cc1O)-c1cc(O)c2c(cccc2=O)o1
: