Target
DNA gyrase subunit B
Ligand
BDBM50010364
Substrate
Meas. Tech.
ChEMBL_1353018 (CHEMBL3270626)
IC50
8.0±n/a nM
Citation
 Ahuja, VBasavarajappa, HP, SHBoriack-Sjodin, PAMcKinney, DGanguly, SKranthi, UGaonkar, SJena, LkGhorpade, SRGhosh, ABarde, SKale, MGKoushik, KKumar, CNManjunatha, MROgg, DPanduga, VRamya, VKReddy, JKumar, KNGiridhar, JRudrapatna, SSharma, STucker, JAVachaspati, PWaterson, Dde Sousa, SM Thiazolopyridine ureas as novel antitubercular agents acting through inhibition of DNA Gyrase B. Cell Chem Biol 56:8834-48 (2013)  
Target
Name:
DNA gyrase subunit B
Synonyms:
GYRB_MYCSM | gyrB
Type:
PROTEIN
Mol. Mass.:
74505.25
Organism:
Mycobacterium smegmatis
Description:
ChEMBL_107961
Residue:
675
  
Inhibitor
Name:
BDBM50010364
Synonyms:
CHEMBL3263606
Type:
Small organic molecule
Emp. Form.:
C20H23N5O4S
Mol. Mass.:
429.493
SMILES:
CCNC(=O)Nc1nc2cc(-c3cncc(OC)c3)c(OCC3CCOC3)nc2s1
: