Target
Accessory gene regulator protein A
Ligand
BDBM11318
Substrate
Meas. Tech.
ChEMBL_1366621 (CHEMBL3296715)
IC50
17100±n/a nM
Citation
 Figueroa, MJarmusch, AKRaja, HAEl-Elimat, TKavanaugh, JSHorswill, ARCooks, RGCech, NBOberlies, NH Polyhydroxyanthraquinones as quorum sensing inhibitors from the guttates of Penicillium restrictum and their analysis by desorption electrospray ionization mass spectrometry. J Nat Prod 77:1351-8 (2014)  
Target
Name:
Accessory gene regulator protein A
Synonyms:
AGRA_STAAU agrA
Type:
PROTEIN
Mol. Mass.:
27903.57
Organism:
Staphylococcus aureus
Description:
ChEMBL_1366621
Residue:
238
  
Inhibitor
Name:
BDBM11318
Synonyms:
1,3,8-trihydroxy-6-methyl-9,10-dihydroanthracene-9,10-dione CHEMBL289277 US20230364057, Compound 242 | med.21724, Compound 24
Type:
Small organic molecule
Emp. Form.:
C15H10O5
Mol. Mass.:
270.2369
SMILES:
Cc1cc(O)c2C(=O)c3c(O)cc(O)cc3C(=O)c2c1
: