Target
Metabotropic glutamate receptor 4
Ligand
BDBM50293721
Substrate
Meas. Tech.
ChEMBL_1434272 (CHEMBL3385817)
IC50
13±n/a nM
Citation
 Kil, KEPoutiainen, PZhang, ZZhu, AChoi, JKJokivarsi, KBrownell, AL Radiosynthesis and evaluation of an 18F-labeled positron emission tomography (PET) radioligand for metabotropic glutamate receptor subtype 4 (mGlu4). J Med Chem 57:9130-8 (2014)  
Target
Name:
Metabotropic glutamate receptor 4
Synonyms:
GRM4_RAT Grm4 Metabotropic glutamate receptor 4 (mGlu4) mGlu4 metabotropic glutamate 4a
Type:
Enzyme
Mol. Mass.:
101849.79
Organism:
Rattus norvegicus (Rat)
Description:
P31423
Residue:
912
  
Inhibitor
Name:
BDBM50293721
Synonyms:
CHEMBL562551 cid_44191096
Type:
Small organic molecule
Emp. Form.:
C13H11ClN2O2
Mol. Mass.:
262.692
SMILES:
COc1cc(NC(=O)c2ccccn2)ccc1Cl
: