Target
Hexokinase-1
Ligand
BDBM50169033
Substrate
Meas. Tech.
ChEMBL_1577557 (CHEMBL3807033)
IC50
7.9±n/a nM
Citation
 Lin, HZeng, JXie, RSchulz, MJTedesco, RQu, JErhard, KFMack, JFRaha, KRendina, ARSzewczuk, LMKratz, PMJurewicz, AJCecconie, TMartens, SMcDevitt, PJMartin, JDChen, SBJiang, YNickels, LSchwartz, BJSmallwood, AZhao, BCampobasso, NQian, YBriand, JRominger, CMOleykowski, CHardwicke, MALuengo, JI Discovery of a Novel 2,6-Disubstituted Glucosamine Series of Potent and Selective Hexokinase 2 Inhibitors. ACS Med Chem Lett 7:217-22 (2016)  
Target
Name:
Hexokinase-1
Synonyms:
Brain form hexokinase HK1 Hexokinase type I hexokinase-1 isoform HKI
Type:
PROTEIN
Mol. Mass.:
102488.34
Organism:
Homo sapiens (Human)
Description:
EBI_11382
Residue:
917
  
Inhibitor
Name:
BDBM50169033
Synonyms:
CHEMBL3806069
Type:
Small organic molecule
Emp. Form.:
C26H25N3O7S
Mol. Mass.:
523.558
SMILES:
OC1O[C@H](CNS(=O)(=O)c2ccc(cc2)C#N)[C@@H](O)[C@H](O)[C@H]1NC(=O)c1cccc(c1)-c1ccccc1
: