Target
Glucagon-like peptide 1 receptor
Ligand
BDBM50231902
Substrate
Meas. Tech.
ChEMBL_1645788 (CHEMBL3994844)
Ki
0.820000±n/a nM
Citation
 Plisson, FHill, TAMitchell, JMHoang, HNde Araujo, ADXu, WCotterell, AEdmonds, DJStanton, RVDerksen, DRLoria, PMGriffith, DAPrice, DALiras, SFairlie, DP Helixconstraints and amino acid substitution in GLP-1 increase cAMP and insulin secretion but not beta-arrestin 2 signaling. Eur J Med Chem 127:703-714 (2017)  
Target
Name:
Glucagon-like peptide 1 receptor
Synonyms:
GLP-1 receptor GLP-1R GLP1R_HUMAN Glucagon-like peptide 1 receptor (GLP-1)
Type:
Enzyme
Mol. Mass.:
53035.78
Organism:
Homo sapiens (Human)
Description:
P43220
Residue:
463
  
Inhibitor
Name:
BDBM50231902
Synonyms:
CHEMBL4096416
Type:
Small organic molecule
Emp. Form.:
C162H236N42O48
Mol. Mass.:
3539.8598
SMILES:
CC[C@H](C)[C@H](NC(=O)[C@H](Cc1ccccc1)NC(=O)[C@H](CCC(O)=O)NC(=O)[C@H](CCCCN)NC(=O)[C@H](C)NC(=O)[C@H](C)NC(=O)[C@H](CCC(N)=O)NC(=O)[C@@H]1CCC(=O)NCCCC[C@H](NC(=O)[C@H](CO)NC(=O)[C@H](Cc2ccc(O)cc2)NC(=O)[C@H](CC(O)=O)NC(=O)[C@H](CO)NC(=O)[C@@H](NC(=O)[C@H](Cc2ccccc2)NC(=O)[C@@H](NC(=O)CNC(=O)[C@H](CCC(O)=O)NC(=O)[C@H](C)NC(=O)[C@@H](N)Cc2cnc[nH]2)[C@@H](C)O)[C@@H](C)O)C(=O)N[C@@H](Cc2ccc(O)cc2)C(=O)N[C@@H](CC(C)C)C(=O)N[C@@H](CCC(O)=O)C(=O)N1)C(=O)N[C@H]1CCCCNC(=O)C[C@H](NC(=O)[C@@H](NC(=O)[C@H](CC(C)C)NC(=O)[C@H](Cc2c[nH]c3ccccc23)NC1=O)C(C)C)C(=O)NCC(=O)N[C@@H](CCCNC(N)=N)C(=O)NCC(N)=O
: