Target
Carboxylic ester hydrolase
Ligand
BDBM50235225
Substrate
Meas. Tech.
ChEMBL_1655009 (CHEMBL4004375)
IC50
40±n/a nM
Citation
 Singh, HSingh, JVGupta, MKSingh, PSharma, SNepali, KBedi, PMS Benzoflavones as cholesterol esterase inhibitors: Synthesis, biological evaluation and docking studies. Bioorg Med Chem Lett 27:850-854 (2017)  
Target
Name:
Carboxylic ester hydrolase
Synonyms:
3.1.1.- Carboxylic ester hydrolase
Type:
PROTEIN
Mol. Mass.:
63554.81
Organism:
Sus scrofa
Description:
ChEMBL_117582
Residue:
585
  
Inhibitor
Name:
BDBM50235225
Synonyms:
CHEMBL4073942
Type:
Small organic molecule
Emp. Form.:
C20H13ClO2
Mol. Mass.:
320.769
SMILES:
ClCc1cccc(c1)-c1cc(=O)c2ccc3ccccc3c2o1
: