Target
5-hydroxytryptamine receptor 1B
Ligand
BDBM136316
Substrate
Meas. Tech.
Inhibition Assay
pH
7.4±n/a
Ki
1.1±n/a nM
Comments
extracted
Citation
 Andersson, JGyback, HJohansson, ALinde, CEMalmstrom, JNordvall, GWeigelt, TTerp, G 2-carboxamide-7-piperazinyl-benzofuran derivatives US Patent  US8859534 Publication Date 10/14/2014 
Target
Name:
5-hydroxytryptamine receptor 1B
Synonyms:
5-HT1B 5-hydroxytryptamine receptor 1B (5HT1B) HTR1B
Type:
Protein
Mol. Mass.:
42909.60
Organism:
Cricetulus griseus (Chinese hamster) (Cricetulus barabensis griseus)
Description:
P46636
Residue:
386
  
Inhibitor
Name:
BDBM136316
Synonyms:
US8859534, 2
Type:
Small organic molecule
Emp. Form.:
C30H33N5O3
Mol. Mass.:
511.6147
SMILES:
O=C(Nc1ccc(cc1)N1CCOCC1)c1cc2cccc(N3CCN(CCc4ccccn4)CC3)c2o1
: