Target
5-hydroxytryptamine receptor 1B
Ligand
BDBM136334
Substrate
Meas. Tech.
Inhibition Assay
pH
7.4±n/a
Ki
7.6±n/a nM
Comments
extracted
Citation
 Andersson, JGyback, HJohansson, ALinde, CEMalmstrom, JNordvall, GWeigelt, TTerp, G 2-carboxamide-7-piperazinyl-benzofuran derivatives US Patent  US8859534 Publication Date 10/14/2014 
Target
Name:
5-hydroxytryptamine receptor 1B
Synonyms:
5-HT1B 5-hydroxytryptamine receptor 1B (5HT1B) HTR1B
Type:
Protein
Mol. Mass.:
42909.60
Organism:
Cricetulus griseus (Chinese hamster) (Cricetulus barabensis griseus)
Description:
P46636
Residue:
386
  
Inhibitor
Name:
BDBM136334
Synonyms:
US8859534, 20
Type:
Small organic molecule
Emp. Form.:
C27H26N6O2
Mol. Mass.:
466.5343
SMILES:
O=C(NCc1ccc(nc1)C#N)c1cc2cccc(N3CCN(CCc4ccccn4)CC3)c2o1
: