Target
cAMP-specific 3',5'-cyclic phosphodiesterase 4A
Ligand
BDBM285634
Substrate
Meas. Tech.
Biological Assays
IC50
<0.488±n/a nM
Citation
 Chappie, TAPatel, NCHayward, MMHelal, CJSciabola, SLaChapelle, EAYoung, JMVerhoest, PR Imidazopyridazine compounds US Patent  US10669279 Publication Date 6/2/2020 
Target
Name:
cAMP-specific 3',5'-cyclic phosphodiesterase 4A
Synonyms:
3',5'-cyclic phosphodiesterase PDE46 PDE4A_HUMAN Phosphodiesterase 4A | Phosphodiesterase 4A (PDE4)
Type:
Enzyme
Mol. Mass.:
98113.27
Organism:
Homo sapiens (Human)
Description:
P27815
Residue:
886
  
Inhibitor
Name:
BDBM285634
Synonyms:
3-(4-chloro-3,5-difluoro-phenyl)-N-cyclopropyl-imidazo[1,2-b]pyridazine-2-carboxamide US10669279, Example 104 | US9598421, Example 104
Type:
Small organic molecule
Emp. Form.:
C16H11ClF2N4O
Mol. Mass.:
348.735
SMILES:
Fc1cc(cc(F)c1Cl)-c1c(nc2cccnn12)C(=O)NC1CC1
: