Target
Replicase polyprotein 1ab
Ligand
BDBM448295
Substrate
Meas. Tech.
The enzymatic inhibition assay
IC50
51±0.50 nM
Citation
 Qiao, JLi, YSZeng, RLiu, FLLuo, RHHuang, CWang, YFZhang, JQuan, BShen, CMao, XLiu, XSun, WYang, WNi, XWang, KXu, LDuan, ZLZou, QCZhang, HLQu, WLong, YHLi, MHYang, RCLiu, XYou, JZhou, YYao, RLi, WPLiu, JMChen, PLiu, YLin, GFYang, XZou, JLi, LHu, YLu, GWLi, WMWei, YQZheng, YTLei, JYang, S SARS-CoV-2 Mpro inhibitors with antiviral activity in a transgenic mouse model Science 0:0 (2021)  
Target
Name:
Replicase polyprotein 1ab
Synonyms:
ORF1ab polyprotein pp1ab | rep
Type:
Protein
Mol. Mass.:
794070.71
Organism:
2019-nCoV
Description:
P0DTD1
Residue:
7096
  
Inhibitor
Name:
BDBM448295
Synonyms:
MI-10
Type:
Small organic molecule
Emp. Form.:
C23H27BrClN3O5
Mol. Mass.:
540.835
SMILES:
CC1(C)[C@H]2CN([C@H]([C@@H]12)C(=O)N[C@@H](C[C@@H]1CCNC1=O)C=O)C(=O)COc1ccc(Cl)c(Br)c1
: