Target
Potassium voltage-gated channel subfamily H member 2
Ligand
BDBM470064
Substrate
Meas. Tech.
Test for Evaluating hERG Inhibition
IC50
<300±n/a nM
Citation
 Ban, HKamioka, SSawayama, YHashizume, M Dihydrochromene derivatives US Patent  US10807993 Publication Date 10/20/2020 
Target
Name:
Potassium voltage-gated channel subfamily H member 2
Synonyms:
1,3-beta-glucan synthase component GLS2 ERG Eag-related protein 1 Ether-a-go-go-related gene (HERG) Ether-a-go-go-related gene potassium channel 1 Ether-a-go-go-related gene potassium channel 1 (hERG1) Ether-a-go-go-related protein 1 H-ERG KCNH2 Potassium voltage-gated channel subfamily H member 2 (hERG) Voltage-gated potassium channel subunit Kv11.1 hERG Potassium Channel 1 | putative potassium channel subunit
Type:
Multi-pass membrane protein
Mol. Mass.:
126672.65
Organism:
Homo sapiens (Human)
Description:
Q12809
Residue:
1159
  
Inhibitor
Name:
BDBM470064
Synonyms:
US10807993, Example 3 | US10807993, Example 4
Type:
Small organic molecule
Emp. Form.:
C24H30ClN3O3
Mol. Mass.:
443.966
SMILES:
Cc1nccn1CC(=O)N1CC[C@@]2(CC1)COC1C(C2)C(C)(C)Oc2ccc(Cl)cc12
: