Target
Potassium voltage-gated channel subfamily H member 2
Ligand
BDBM470086
Substrate
Meas. Tech.
Test for Evaluating hERG Inhibition
IC50
600±n/a nM
Citation
 Ban, HKamioka, SSawayama, YHashizume, M Dihydrochromene derivatives US Patent  US10807993 Publication Date 10/20/2020 
Target
Name:
Potassium voltage-gated channel subfamily H member 2
Synonyms:
1,3-beta-glucan synthase component GLS2 ERG Eag-related protein 1 Ether-a-go-go-related gene (HERG) Ether-a-go-go-related gene potassium channel 1 Ether-a-go-go-related gene potassium channel 1 (hERG1) Ether-a-go-go-related protein 1 H-ERG KCNH2 Potassium voltage-gated channel subfamily H member 2 (hERG) Voltage-gated potassium channel subunit Kv11.1 hERG Potassium Channel 1 | putative potassium channel subunit
Type:
Multi-pass membrane protein
Mol. Mass.:
126672.65
Organism:
Homo sapiens (Human)
Description:
Q12809
Residue:
1159
  
Inhibitor
Name:
BDBM470086
Synonyms:
US10807993, Example 25 | US10807993, Example 26
Type:
Small organic molecule
Emp. Form.:
C23H30ClN3O2
Mol. Mass.:
415.956
SMILES:
Cc1nc[nH]c1CN1CC[C@@]2(CC1)COC1C(C2)C(C)(C)Oc2ccc(Cl)cc12
: